{"text_format":"1","workbook":"xlsx","n_sheets":11,"sheets":["Menu","Inputs","Postcode Zones","STC Calculator","Lease Financials","Lease Calculator Gross","Lease Calculator Net","Comparison Graph","Model Gross","Model Net","Asset Finance Proposal"],"not_rendered":{"charts":2,"images":16,"macros":1,"external_links":1,"defined_names":9,"comments":0,"pivot_tables":0},"unopened":[{"sheet":"Comparison Graph","index":7,"reason":"not_a_worksheet"}],"bounds":{"document_bytes":16777216,"sheet_cells":100000,"rows_first":2000,"rows_last":500,"rows_between":2000,"halvings":0,"cell_chars":16384,"cell_head_chars":4096},"cells_cut":0,"cells_raw":0,"read":"whole","date_system":"1900"}

{"sheet":"Menu","index":0,"n_rows":0,"n_cols":0,"rows_kept":0,"cut":false,"hidden":false,"merged":[]}

{"sheet":"Inputs","index":1,"n_rows":38,"n_cols":17,"rows_kept":38,"cut":false,"hidden":true,"merged":[]}
[]
[]
[]
[]
[]
[]
[null,null,null,"Project inputs"]
[]
[null,null,null,"Gross Cost (Excluding Rebate)",null,null,null,184000]
[null,null,null,"Rebate",null,null,null,{"$f":"IF(H28>0,'STC Calculator'!F14,\"\")","v":76701},null,{"$f":"IF(H28>0,'STC Calculator'!F14,\"\")","v":76701}]
[null,null,null,"Net Cost (After Rebate)",null,null,null,{"$f":"H9-H10","v":107299},null,null,null,null,null,null,"Project Type List"]
[null,null,null,"Project Type",null,null,null,"PV",null,null,null,null,null,null,"PV"]
[null,null,null,"Project Annual Savings",null,null,null,25000,null,null,null,null,null,null,"Lighting"]
[null,null,null,null,null,null,null,null,null,null,null,null,null,null,"Other"]
[]
[null,null,null,"Customise Report:"]
[null,null,null,"Retailer Logo",null,null,null,null,null,null,"Data to be input in Input Field 2 - Project Details"]
[null,null,null,"Retailer Company Name",null,null,null,"Solar Manager"]
[null,null,null,"Customer Logo"]
[null,null,null,"Customer Company Name",null,null,null,"Motto Farm Motel"]
{"$rows_left_out":19}
{"sheet":"Postcode Zones","index":2,"n_rows":15606,"n_cols":4,"rows_kept":15606,"cut":false,"hidden":true,"merged":[]}
["Postcode PV STC","Date:  Tuesday, 15 April 2014\nTime: 09:46 AM"]
[]
[]
["CER Postcode","CER PV Zone","CER State","CER Suburb"]
[200,3,"ACT","AUSTRALIAN NATIONAL UNIVERSITY"]
[800,2,"NT","DARWIN"]
[801,2,"NT","DARWIN"]
[804,2,"NT","PARAP"]
[810,2,"NT","MILLNER"]
[810,2,"NT","NAKARA"]
[810,2,"NT","TIWI"]
[810,2,"NT","BRINKIN"]
[810,2,"NT","JINGILI"]
[810,2,"NT","RAPID CREEK"]
[810,2,"NT","WANGURI"]
[810,2,"NT","LYONS"]
[810,2,"NT","MUIRHEAD"]
[810,2,"NT","ALAWA"]
[810,2,"NT","COCONUT GROVE"]
[810,2,"NT","NIGHTCLIFF"]
{"$rows_left_out":15587}
{"sheet":"STC Calculator","index":3,"n_rows":16,"n_cols":9,"rows_kept":16,"cut":false,"hidden":true,"merged":[]}
[]
[]
[]
[]
[]
[]
[]
[null,null,null,"Input Zone and System Size:"]
[null,null,null,"Zone",null,{"$f":"VLOOKUP(Inputs!H29,'Postcode Zones'!A5:B15606,2,FALSE)","v":3},null,"Zone ","Zone Rating"]
[null,null,null,"System Size (kWp)",null,{"$f":"Inputs!H28","v":100},null,1,1.6220000000000001]
[null,null,null,null,null,null,null,2,1.536]
[null,null,null,"RECS = ",null,{"$f":"IF(F10>100,\"NOT ELIGIBLE\",INT(15*(VLOOKUP(F9,H10:I13,2,TRUE)*F10)))","v":2073},null,3,1.3819999999999999]
[null,null,null,null,null,null,null,4,1.1850000000000001]
[null,null,null,"Value",null,{"$f":"F12*F16","v":76701}]
[]
[null,null,null,"REC Price",null,{"$f":"Inputs!H30","v":37}]

{"sheet":"Lease Financials","index":4,"n_rows":73,"n_cols":124,"rows_kept":73,"cut":false,"hidden":true,"merged":[]}
[]
[null,"Lease Finance Assessment",null,null,null,null,null,2,3,4,5,7]
[null,null,null,null,"Gross Cost",null,{"$f":"Inputs!H9","v":184000},{"$f":"'Lease Calculator Gross'!D15","v":8587.5731636997771},{"$f":"'Lease Calculator Gross'!D16","v":6037.6266547641662},{"$f":"'Lease Calculator Gross'!D17","v":4686.4957740553818},{"$f":"'Lease Calculator Gross'!D18","v":3985.3541474109206},{"$f":"'Lease Calculator Gross'!D19","v":3090.9985096833898}]
[null,null,null,null,"Net Cost",null,{"$f":"Inputs!H11","v":107299},{"$f":"'Lease Calculator Net'!D15","v":5007.8152874555562},{"$f":"'Lease Calculator Net'!D16","v":3520.8222958127185},{"$f":"'Lease Calculator Net'!D17","v":2732.914728588959},{"$f":"'Lease Calculator Net'!D18","v":2324.0462753426323},{"$f":"'Lease Calculator Net'!D19","v":1802.5057015789025}]
[null,null,null,null,"Rebate Value",null,{"$f":"G3-G4","v":76701}]
[null,null,null,null,"Annual Savings",null,{"$f":"Inputs!H13","v":25000},null,"Selected","Amount","Payments","Payout"]
[null,null,null,null,"Net Lease Term",null,{"$f":"Inputs!H24","v":7},null,"Net Lease",{"$f":"HLOOKUP(G7,H2:L4,3,FALSE)","v":1802.5057015789025},{"$f":"G7*12","v":84},{"$f":"3*J7","v":5407.5171047367076}]
[null,null,null,null,"Gross Lease Term",null,{"$f":"Inputs!H25","v":7},null,"Gross Lease",{"$f":"HLOOKUP(G8,H2:L4,2,FALSE)","v":3090.9985096833898},{"$f":"G8*12","v":84},{"$f":"3*J8","v":9272.9955290501694}]
[null,null,null,null,"Lease Preference",null,{"$f":"Inputs!H26","v":0}," ","Display",null,{"$f":"Inputs!H26","v":0}]
[null,null,null,null,"All ex GST"]
[null,"Option 1 - Outright Purchase"]
[null,"Month",null,0,1,2,3,4,5,6,7,8,9,10,11,12,13,14,15,16,17,18,19,20,21,22,23,24,25,26,27,28,29,30,31,32,33,34,35,36,37,38,39,40,41,42,43,44,45,46,47,48,49,50,51,52,53,54,55,56,57,58,59,60,61,62,63,64,65,66,67,68,69,70,71,72,73,74,75,76,77,78,79,80,81,82,83,84,85,86,87,88,89,90,91,92,93,94,95,96,97,98,99,100,101,102,103,104,105,106,107,108,109,110,111,112,113,114,115,116,117,118,119,120]
[null,"Payment",null,{"$f":"-G4","v":-107299},0,0,0,0,0,0,0,0,0,0,0,0,0,0,0,0,0,0,0,0,0,0,0,0,0,0,0,0,0,0,0,0,0,0,0,0,0,0,0,0,0,0,0,0,0,0,0,0,0,0,0,0,0,0,0,0,0,0,0,0,0,0,0,0,0,0,0,0,0,0,0,0,0,0,0,0,0,0,0,0,0,0,0,0,0,0,0,0,0,0,0,0,0,0,0,0,0,0,0,0,0,0,0,0,0,0,0,0,0,0,0,0,0,0,0,0,0,0,0,0]
[null,"Lease Payments",null,0,0,0,0,0,0,0,0,0,0,0,0,0,0,0,0,0,0,0,0,0,0,0,0,0,0,0,0,0,0,0,0,0,0,0,0,0,0,0,0,0,0,0,0,0,0,0,0,0,0,0,0,0,0,0,0,0,0,0,0,0,0,0,0,0,0,0,0,0,0,0,0,0,0,0,0,0,0,0,0,0,0,0,0,0,0,0,0,0,0,0,0,0,0,0,0,0,0,0,0,0,0,0,0,0,0,0,0,0,0,0,0,0,0,0,0,0,0,0,0,0]
[null,"Energy Savings",null,0,{"$f":"G6/12","v":2083.3333333333335},{"$f":"E15","v":2083.3333333333335},{"$f":"F15","v":2083.3333333333335},2083.3333333333335,2083.3333333333335,2083.3333333333335,2083.3333333333335,2083.3333333333335,2083.3333333333335,2083.3333333333335,2083.3333333333335,2083.3333333333335,2083.3333333333335,2083.3333333333335,2083.3333333333335,2083.3333333333335,2083.3333333333335,2083.3333333333335,2083.3333333333335,2083.3333333333335,2083.3333333333335,2083.3333333333335,2083.3333333333335,2083.3333333333335,2083.3333333333335,2083.3333333333335,2083.3333333333335,2083.3333333333335,2083.3333333333335,2083.3333333333335,2083.3333333333335,2083.3333333333335,2083.3333333333335,2083.3333333333335,2083.3333333333335,2083.3333333333335,2083.3333333333335,2083.3333333333335,2083.3333333333335,2083.3333333333335,2083.3333333333335,2083.3333333333335,2083.3333333333335,2083.3333333333335,2083.3333333333335,2083.3333333333335,2083.3333333333335,2083.3333333333335,2083.3333333333335,2083.3333333333335,2083.3333333333335,2083.3333333333335,2083.3333333333335,2083.3333333333335,2083.3333333333335,2083.3333333333335,2083.3333333333335,2083.3333333333335,2083.3333333333335,2083.3333333333335,2083.3333333333335,2083.3333333333335,2083.3333333333335,2083.3333333333335,2083.3333333333335,2083.3333333333335,{"$f":"BR15","v":2083.3333333333335},2083.3333333333335,2083.3333333333335,2083.3333333333335,2083.3333333333335,2083.3333333333335,2083.3333333333335,2083.3333333333335,2083.3333333333335,2083.3333333333335,2083.3333333333335,2083.3333333333335,2083.3333333333335,2083.3333333333335,2083.3333333333335,2083.3333333333335,2083.3333333333335,2083.3333333333335,2083.3333333333335,2083.3333333333335,2083.3333333333335,2083.3333333333335,2083.3333333333335,2083.3333333333335,2083.3333333333335,2083.3333333333335,2083.3333333333335,2083.3333333333335,2083.3333333333335,2083.3333333333335,2083.3333333333335,2083.3333333333335,2083.3333333333335,2083.3333333333335,2083.3333333333335,2083.3333333333335,2083.3333333333335,2083.3333333333335,2083.3333333333335,2083.3333333333335,2083.3333333333335,2083.3333333333335,2083.3333333333335,2083.3333333333335,2083.3333333333335,2083.3333333333335,2083.3333333333335,2083.3333333333335,2083.3333333333335,2083.3333333333335,2083.3333333333335,2083.3333333333335,2083.3333333333335,2083.3333333333335]
[null,"Maintenance Savings"]
[null,"Total Savings",null,{"$f":"SUM(D13:D16)","v":-107299},{"$f":"E15+E16-E14","v":2083.3333333333335},{"$f":"F15+F16-F14","v":2083.3333333333335},2083.3333333333335,2083.3333333333335,2083.3333333333335,2083.3333333333335,2083.3333333333335,2083.3333333333335,2083.3333333333335,2083.3333333333335,2083.3333333333335,2083.3333333333335,2083.3333333333335,2083.3333333333335,2083.3333333333335,2083.3333333333335,2083.3333333333335,2083.3333333333335,2083.3333333333335,2083.3333333333335,2083.3333333333335,2083.3333333333335,2083.3333333333335,2083.3333333333335,2083.3333333333335,{"$f":"AD15+AD16-AD14","v":2083.3333333333335},2083.3333333333335,2083.3333333333335,2083.3333333333335,2083.3333333333335,2083.3333333333335,2083.3333333333335,2083.3333333333335,2083.3333333333335,2083.3333333333335,2083.3333333333335,2083.3333333333335,2083.3333333333335,2083.3333333333335,2083.3333333333335,2083.3333333333335,2083.3333333333335,2083.3333333333335,2083.3333333333335,2083.3333333333335,2083.3333333333335,2083.3333333333335,2083.3333333333335,2083.3333333333335,2083.3333333333335,2083.3333333333335,2083.3333333333335,2083.3333333333335,2083.3333333333335,2083.3333333333335,2083.3333333333335,2083.3333333333335,{"$f":"BJ15+BJ16-BJ14","v":2083.3333333333335},2083.3333333333335,2083.3333333333335,2083.3333333333335,2083.3333333333335,2083.3333333333335,2083.3333333333335,2083.3333333333335,2083.3333333333335,2083.3333333333335,2083.3333333333335,2083.3333333333335,2083.3333333333335,2083.3333333333335,2083.3333333333335,2083.3333333333335,2083.3333333333335,2083.3333333333335,2083.3333333333335,2083.3333333333335,2083.3333333333335,2083.3333333333335,2083.3333333333335,2083.3333333333335,2083.3333333333335,2083.3333333333335,2083.3333333333335,2083.3333333333335,2083.3333333333335,2083.3333333333335,2083.3333333333335,2083.3333333333335,{"$f":"CP15+CP16-CP14","v":2083.3333333333335},2083.3333333333335,2083.3333333333335,2083.3333333333335,2083.3333333333335,2083.3333333333335,2083.3333333333335,2083.3333333333335,2083.3333333333335,2083.3333333333335,2083.3333333333335,2083.3333333333335,2083.3333333333335,2083.3333333333335,2083.3333333333335,2083.3333333333335,2083.3333333333335,2083.3333333333335,2083.3333333333335,2083.3333333333335,2083.3333333333335,2083.3333333333335,2083.3333333333335,2083.3333333333335,2083.3333333333335,2083.3333333333335,2083.3333333333335,2083.3333333333335,2083.3333333333335,2083.3333333333335,2083.3333333333335]
[]
[null,"Net Position",null,{"$f":"D13+D15-D14","v":-107299},2083.3333333333335,2083.3333333333335,2083.3333333333335,2083.3333333333335,2083.3333333333335,2083.3333333333335,2083.3333333333335,2083.3333333333335,2083.3333333333335,2083.3333333333335,2083.3333333333335,2083.3333333333335,2083.3333333333335,2083.3333333333335,2083.3333333333335,2083.3333333333335,2083.3333333333335,2083.3333333333335,2083.3333333333335,2083.3333333333335,2083.3333333333335,2083.3333333333335,2083.3333333333335,2083.3333333333335,2083.3333333333335,2083.3333333333335,2083.3333333333335,2083.3333333333335,2083.3333333333335,2083.3333333333335,2083.3333333333335,{"$f":"AJ13+AJ15-AJ14","v":2083.3333333333335},2083.3333333333335,2083.3333333333335,2083.3333333333335,2083.3333333333335,2083.3333333333335,2083.3333333333335,2083.3333333333335,2083.3333333333335,2083.3333333333335,2083.3333333333335,2083.3333333333335,2083.3333333333335,2083.3333333333335,2083.3333333333335,2083.3333333333335,2083.3333333333335,2083.3333333333335,2083.3333333333335,2083.3333333333335,2083.3333333333335,2083.3333333333335,2083.3333333333335,2083.3333333333335,2083.3333333333335,2083.3333333333335,2083.3333333333335,2083.3333333333335,2083.3333333333335,2083.3333333333335,2083.3333333333335,2083.3333333333335,{"$f":"BP13+BP15-BP14","v":2083.3333333333335},2083.3333333333335,2083.3333333333335,2083.3333333333335,2083.3333333333335,2083.3333333333335,2083.3333333333335,2083.3333333333335,2083.3333333333335,2083.3333333333335,2083.3333333333335,2083.3333333333335,2083.3333333333335,2083.3333333333335,2083.3333333333335,2083.3333333333335,2083.3333333333335,2083.3333333333335,2083.3333333333335,2083.3333333333335,2083.3333333333335,2083.3333333333335,2083.3333333333335,2083.3333333333335,2083.3333333333335,2083.3333333333335,2083.3333333333335,2083.3333333333335,2083.3333333333335,2083.3333333333335,2083.3333333333335,2083.3333333333335,{"$f":"CV13+CV15-CV14","v":2083.3333333333335},2083.3333333333335,2083.3333333333335,2083.3333333333335,2083.3333333333335,2083.3333333333335,2083.3333333333335,2083.3333333333335,2083.3333333333335,2083.3333333333335,2083.3333333333335,2083.3333333333335,2083.3333333333335,2083.3333333333335,2083.3333333333335,2083.3333333333335,2083.3333333333335,2083.3333333333335,2083.3333333333335,2083.3333333333335,2083.3333333333335,2083.3333333333335,2083.3333333333335,2083.3333333333335,2083.3333333333335]
[null,"Cumulative Position",null,{"$f":"D19","v":-107299},{"$f":"E19+D20","v":-105215.66666666667},{"$f":"E20+F19","v":-103132.33333333334},{"$f":"F20+G19","v":-101049.00000000001},-98965.666666666686,-96882.333333333358,-94799.000000000029,-92715.666666666701,-90632.333333333372,-88549.000000000044,-86465.666666666715,-84382.333333333387,-82299.000000000058,-80215.66666666673,-78132.333333333401,-76049.000000000073,-73965.666666666744,-71882.333333333416,-69799.000000000087,-67715.666666666759,-65632.33333333343,-63549.000000000095,-61465.666666666759,-59382.333333333423,-57299.000000000087,-55215.666666666752,-53132.333333333416,-51049.00000000008,-48965.666666666744,-46882.333333333409,-44799.000000000073,-42715.666666666737,-40632.333333333401,-38549.000000000065,-36465.66666666673,-34382.333333333394,-32299.000000000062,-30215.66666666673,-28132.333333333398,-26049.000000000065,-23965.666666666733,-21882.333333333401,-19799.000000000069,-17715.666666666737,-15632.333333333403,-13549.000000000069,-11465.666666666735,-9382.3333333334012,-7299.0000000000673,-5215.6666666667334,-3132.3333333333999,-1049.0000000000664,1034.3333333332671,3117.6666666666006,5200.9999999999345,7284.3333333332685,9367.6666666666024,11450.999999999936,13534.33333333327,15617.666666666604,17700.999999999938,19784.33333333327,21867.666666666602,23950.999999999935,26034.333333333267,28117.666666666599,30200.999999999931,{"$f":"BR20+BS19","v":32284.333333333263},34367.666666666599,36450.999999999935,38534.33333333327,40617.666666666606,42700.999999999942,44784.333333333278,46867.666666666613,48950.999999999949,51034.333333333285,53117.666666666621,55200.999999999956,57284.333333333292,59367.666666666628,61450.999999999964,63534.333333333299,65617.666666666628,67700.999999999956,69784.333333333285,71867.666666666613,73950.999999999942,76034.33333333327,78117.666666666599,80200.999999999927,82284.333333333256,84367.666666666584,86450.999999999913,88534.333333333241,90617.66666666657,92700.999999999898,94784.333333333227,96867.666666666555,98950.999999999884,101034.33333333321,103117.66666666654,105200.99999999987,107284.3333333332,109367.66666666653,111450.99999999985,113534.33333333318,115617.66666666651,117700.99999999984,119784.33333333317,121867.6666666665,123950.99999999983,126034.33333333315,128117.66666666648,130200.99999999981,132284.33333333314,134367.66666666648,136450.99999999983,138534.33333333317,140617.66666666651,142700.99999999985]
{"$rows_left_out":54}
{"sheet":"Lease Calculator Gross","index":5,"n_rows":26,"n_cols":4,"rows_kept":26,"cut":false,"hidden":true,"merged":[]}
[]
[]
[null,null,"Gross Cost"]
[]
[]
[null,null,"Approximate Lease Repayment Calculator","2013-11-01"]
[]
[]
[]
[null,null,"What is the value to be leased?",{"$f":"'Lease Financials'!G3","v":184000}]
[]
[]
[null,null,"Indicative Repayment (per month)"]
[]
[null,null,"24 month term",{"$f":"'Model Gross'!H30","v":8587.5731636997771}]
[null,null,"36 month term",{"$f":"'Model Gross'!I30","v":6037.6266547641662}]
[null,null,"48 month term",{"$f":"'Model Gross'!F30","v":4686.4957740553818}]
[null,null,"60 month term",{"$f":"'Model Gross'!M30","v":3985.3541474109206}]
[null,null,"84 month term",{"$f":"'Model Gross'!K30","v":3090.9985096833898}]
[]
{"$rows_left_out":7}
{"sheet":"Lease Calculator Net","index":6,"n_rows":26,"n_cols":4,"rows_kept":26,"cut":false,"hidden":true,"merged":[]}
[]
[]
[null,null,"Net Cost"]
[]
[]
[null,null,"Approximate Lease Repayment Calculator","2013-11-01"]
[]
[]
[]
[null,null,"What is the value to be leased?",{"$f":"'Lease Financials'!G4","v":107299}]
[]
[]
[null,null,"Indicative Repayment (per month)"]
[]
[null,null,"24 month term",{"$f":"'Model Net'!H30","v":5007.8152874555562}]
[null,null,"36 month term",{"$f":"'Model Net'!I30","v":3520.8222958127185}]
[null,null,"48 month term",{"$f":"'Model Net'!F30","v":2732.914728588959}]
[null,null,"60 month term",{"$f":"'Model Net'!M30","v":2324.0462753426323}]
[null,null,"84 month term",{"$f":"'Model Net'!K30","v":1802.5057015789025}]
[]
{"$rows_left_out":7}
{"sheet":"Model Gross","index":8,"n_rows":30,"n_cols":13,"rows_kept":30,"cut":false,"hidden":true,"merged":[[4,4,4,5],[4,7,4,8],[5,4,5,5],[5,7,5,8]]}
[]
[]
[null,null,"PRICING MATRIX - DEMAND MANAGER"]
[]
[null,null,"Client"]
[null,null,"Funder Quote Date",null,"2013-10-17",null,null,"2013-10-17",null,null,"2013-10-18",null,"2013-10-21"]
[]
[null,null,"Option",null,1,2,null,1,2,null,1,null,1]
[]
[null,null,"Cost",null,110531,110531,null,19212,19212,null,248035,null,48318]
[null,null,"Rent",null,3498,2760,null,879,618,null,4085,null,1026]
[null,null,"Payments p.a.",null,12,12,null,12,12,null,12,null,12]
[null,null,"RV ",null,100,100,null,100,100,null,100,null,100]
[null,null,"Term (yrs)",null,3,4,null,2,3,null,7,null,5]
[null,null,"Nominal Rate",null,{"$f":"RATE($E$14*$E$12,$E$11,-E10,$E$13,1)*$E$12","v":9.2428821925298082E-2},{"$f":"RATE(F14*F12,F11,-F10,F13,1)*F12","v":9.632228182024663E-2},null,{"$f":"RATE(H14*H12,H11,-H10,H13,1)*H12","v":0.1043623284803404},{"$f":"RATE(I14*I12,I11,-I10,I13,1)*I12","v":0.10656737716858808},null,{"$f":"RATE(K14*K12,K11,-K10,K13,1)*K12","v":0.10017577450428128},null,{"$f":"RATE(M14*M12,M11,-M10,M13,1)*M12","v":0.10400843099307759}]
[null,null,"Effective Rate",null,{"$f":"(1+E15/E12)^E12-1","v":9.6446698712337797E-2},{"$f":"(1+F15/F12)^F12-1","v":0.10069054999359595},null,{"$f":"(1+H15/H12)^H12-1","v":0.1095018494171085},{"$f":"(1+I15/I12)^I12-1","v":0.11192969312159295},null,{"$f":"(1+K15/K12)^K12-1","v":0.10490565842352839},null,{"$f":"(1+M15/M12)^M12-1","v":0.10911264746934202}]
[]
[null,null,"DM Fee %",null,0.02,0.02,null,0.02,0.02,null,0.02,null,0.02]
[null,null,"Funded Amount",null,{"$f":"E10*(1+E18)","v":112741.62},{"$f":"F10*(1+F18)","v":112741.62},null,{"$f":"H10*(1+H18)","v":19596.240000000002},{"$f":"I10*(1+I18)","v":19596.240000000002},null,{"$f":"K10*(1+K18)","v":252995.7},null,{"$f":"M10*(1+M18)","v":49284.36}]
[null,null,"Revised Rent",null,{"$f":"PMT(E15/E12,E12*E14,-E19,E13,1)","v":3568.008050876575},{"$f":"PMT(F15/F12,F12*F14,-F19,F13,1)","v":2815.2340456636707},null,{"$f":"PMT(H15/H12,H12*H14,-H19,H13,1)","v":896.65465011413107},{"$f":"PMT(I15/I12,I12*I14,-I19,I13,1)","v":630.40697440939755},null,{"$f":"PMT(K15/K12,K12*K14,-K19,K13,1)","v":4166.7163877680414},null,{"$f":"PMT(M15/M12,M12*M14,-M19,M13,1)","v":1046.5453352967438}]
{"$rows_left_out":11}
{"sheet":"Model Net","index":9,"n_rows":30,"n_cols":13,"rows_kept":30,"cut":false,"hidden":true,"merged":[[4,4,4,5],[4,7,4,8],[5,4,5,5],[5,7,5,8]]}
[]
[]
[null,null,"PRICING MATRIX - DEMAND MANAGER"]
[]
[null,null,"Client"]
[null,null,"Funder Quote Date",null,"2013-10-17",null,null,"2013-10-17",null,null,"2013-10-18",null,"2013-10-21"]
[]
[null,null,"Option",null,1,2,null,1,2,null,1,null,1]
[]
[null,null,"Cost",null,110531,110531,null,19212,19212,null,248035,null,48318]
[null,null,"Rent",null,3498,2760,null,879,618,null,4085,null,1026]
[null,null,"Payments p.a.",null,12,12,null,12,12,null,12,null,12]
[null,null,"RV ",null,100,100,null,100,100,null,100,null,100]
[null,null,"Term (yrs)",null,3,4,null,2,3,null,7,null,5]
[null,null,"Nominal Rate",null,{"$f":"RATE($E$14*$E$12,$E$11,-E10,$E$13,1)*$E$12","v":9.2428821925298082E-2},{"$f":"RATE(F14*F12,F11,-F10,F13,1)*F12","v":9.632228182024663E-2},null,{"$f":"RATE(H14*H12,H11,-H10,H13,1)*H12","v":0.1043623284803404},{"$f":"RATE(I14*I12,I11,-I10,I13,1)*I12","v":0.10656737716858808},null,{"$f":"RATE(K14*K12,K11,-K10,K13,1)*K12","v":0.10017577450428128},null,{"$f":"RATE(M14*M12,M11,-M10,M13,1)*M12","v":0.10400843099307759}]
[null,null,"Effective Rate",null,{"$f":"(1+E15/E12)^E12-1","v":9.6446698712337797E-2},{"$f":"(1+F15/F12)^F12-1","v":0.10069054999359595},null,{"$f":"(1+H15/H12)^H12-1","v":0.1095018494171085},{"$f":"(1+I15/I12)^I12-1","v":0.11192969312159295},null,{"$f":"(1+K15/K12)^K12-1","v":0.10490565842352839},null,{"$f":"(1+M15/M12)^M12-1","v":0.10911264746934202}]
[]
[null,null,"DM Fee %",null,0.02,0.02,null,0.02,0.02,null,0.02,null,0.02]
[null,null,"Funded Amount",null,{"$f":"E10*(1+E18)","v":112741.62},{"$f":"F10*(1+F18)","v":112741.62},null,{"$f":"H10*(1+H18)","v":19596.240000000002},{"$f":"I10*(1+I18)","v":19596.240000000002},null,{"$f":"K10*(1+K18)","v":252995.7},null,{"$f":"M10*(1+M18)","v":49284.36}]
[null,null,"Revised Rent",null,{"$f":"PMT(E15/E12,E12*E14,-E19,E13,1)","v":3568.008050876575},{"$f":"PMT(F15/F12,F12*F14,-F19,F13,1)","v":2815.2340456636707},null,{"$f":"PMT(H15/H12,H12*H14,-H19,H13,1)","v":896.65465011413107},{"$f":"PMT(I15/I12,I12*I14,-I19,I13,1)","v":630.40697440939755},null,{"$f":"PMT(K15/K12,K12*K14,-K19,K13,1)","v":4166.7163877680414},null,{"$f":"PMT(M15/M12,M12*M14,-M19,M13,1)","v":1046.5453352967438}]
{"$rows_left_out":11}
{"sheet":"Asset Finance Proposal","index":10,"n_rows":68,"n_cols":12,"rows_kept":68,"cut":false,"hidden":true,"merged":[[1,1,3,4],[25,9,25,11],[29,9,29,11],[31,9,31,11],[37,9,37,11],[23,9,23,11],[1,6,3,8],[22,9,22,11],[9,9,9,11],[11,9,11,11],[13,9,13,11],[15,9,15,11],[17,9,17,11]]}
[]
[]
[]
[]
[null,"Asset Finance Proposal",null,null,null,null,null,null,null,null,"Date:",{"$f":"TODAY()","v":"2014-09-02"}]
[]
[]
[null,null,"Project Details"]
[]
[null,null,"Customer Name",null,null,null,null,null,null,{"$f":"IF(Inputs!H20>0,Inputs!H20,\"\")","v":"Motto Farm Motel"}]
[]
[null,null,"Total Capital Cost",null,null,null,null,null,null,{"$f":"Inputs!H9","v":184000}]
[]
[null,null,"Less Rebate Value",null,null,null,null,null,null,{"$f":"Inputs!H10","v":76701}]
[]
[null,null,"Equals Capex Less Rebate",null,null,null,null,null,null,{"$f":"Inputs!H11","v":107299}]
[]
[null,null,"Expected Annual Savings",null,null,null,null,null,null,{"$f":"Inputs!H13","v":25000}]
[]
[]
{"$rows_left_out":48}